CMake函数“未在此范围内声明”错误

如何解决CMake函数“未在此范围内声明”错误

我是CMake的新手,并且一直在阅读博客以使它生效。当所有文件都在同一个目录中时,我有一个cmake文件正在工作,但似乎无法正常工作-包含目录给我带来了麻烦。在这最后一次尝试中,我引用了this堆栈溢出线程。这是我最近一次使它起作用。请帮忙。

文件树

$ tree
.
├── CMakeLists.txt
├── include
│   ├── CMakeLists.txt
│   └── math.h
├── src
│   ├── CMakeLists.txt
│   └── math.c
└── testy
    ├── CMakeLists.txt
    └── math.cpp

3 directories,7 files

CMake文件

$ more CMakeLists.txt
cmake_minimum_required(VERSION 3.1)
project(iamtesting)
enable_testing()
add_subdirectory(include)
add_subdirectory(src)
add_subdirectory(testy)
$ more include/CMakeLists.txt
add_library(include INTERFACE)
target_include_directories(include INTERFACE ./)
$ more src/CMakeLists.txt
add_library(src STATIC math.c)
target_include_directories(src PUBLIC ./)
$ more testy/CMakeLists.txt
set(TEST_EXE_NAME math)
add_executable(${TEST_EXE_NAME} math.cpp)
target_include_directories(${TEST_EXE_NAME} PUBLIC ./)
target_link_libraries(${TEST_EXE_NAME} src)
add_test(NAME "testDatabase" COMMAND ${TEST_EXE_NAME})

CMake

$ cmake CMakeLists.txt
-- The C compiler identification is GNU 7.5.0
-- The CXX compiler identification is GNU 7.5.0
-- Check for working C compiler: /usr/bin/cc
-- Check for working C compiler: /usr/bin/cc -- works
-- Detecting C compiler ABI info
-- Detecting C compiler ABI info - done
-- Detecting C compile features
-- Detecting C compile features - done
-- Check for working CXX compiler: /usr/bin/c++
-- Check for working CXX compiler: /usr/bin/c++ -- works
-- Detecting CXX compiler ABI info
-- Detecting CXX compiler ABI info - done
-- Detecting CXX compile features
-- Detecting CXX compile features - done
-- Configuring done
-- Generating done
-- Build files have been written to: /home/jason/gtest

制作

$ make
Scanning dependencies of target src
[ 25%] Building C object src/CMakeFiles/src.dir/math.c.o
/home/jason/gtest/src/math.c: In function ‘main’:
/home/jason/gtest/src/math.c:5:24: warning: implicit declaration of function ‘sum’ [-Wimplicit-function-declaration]
   printf("10+20=%d\n",sum(10,20));
                        ^~~
[ 50%] Linking C static library libsrc.a
[ 50%] Built target src
Scanning dependencies of target math
[ 75%] Building CXX object testy/CMakeFiles/math.dir/math.cpp.o
In file included from /usr/include/gtest/gtest.h:1874:0,from /home/jason/gtest/testy/math.cpp:1:
/home/jason/gtest/testy/math.cpp: In member function ‘virtual void widget_ok_Test::TestBody()’:
/home/jason/gtest/testy/math.cpp:5:13: error: ‘sum’ was not declared in this scope
   ASSERT_EQ(sum(1,1),2);
             ^
/home/jason/gtest/testy/math.cpp:5:3: error: template argument 1 is invalid
   ASSERT_EQ(sum(1,2);
   ^
testy/CMakeFiles/math.dir/build.make:62: recipe for target 'testy/CMakeFiles/math.dir/math.cpp.o' failed
make[2]: *** [testy/CMakeFiles/math.dir/math.cpp.o] Error 1
CMakeFiles/Makefile2:158: recipe for target 'testy/CMakeFiles/math.dir/all' failed
make[1]: *** [testy/CMakeFiles/math.dir/all] Error 2
Makefile:94: recipe for target 'all' failed
make: *** [all] Error 2

Src文件

$ more src/math.c
#include <stdio.h>
#include "math.h"

int main() {
  printf("10+20=%d\n",20));
  return 0;
}

int sum(int x,int y) {
    return x + y;
}
$ more include/math.h
#define _MATH_H_

int sum(int,int);
$ more src/math.c
#include <stdio.h>
#include "math.h"

int main() {
  printf("10+20=%d\n",int y) {
    return x + y;
}
$ more testy/math.cpp
#include "gtest/gtest.h"
#include "math.h"

TEST(widget,ok) {
  ASSERT_EQ(sum(1,2);
}

int main(int argc,char **argv) {
    testing::InitGoogleTest(&argc,argv);
    return RUN_ALL_TESTS();
}

解决方法

您的设置存在很多问题:

    不需要
  1. libInclude(在include/CMakeLists.txt中定义)。您需要创建一个库libSrc,该库具有通过include添加的target_include_directories目录。
  2. src文件夹不应通过target_include_directories添加,因为它仅存储实现您功能的源文件,并且在任何地方都绝不能用作#include
  3. 每个程序中只能有一个main函数,因此很可能应该从main中删除src/math.c。您的可执行文件应该有一个main.cpp,它会链接libSrc,测试中应该有一个main方法(对于您的情况,math.cpp,您正在链接{{1} }正确地存在)
  4. libSrc应具有正确的include guard

版权声明:本文内容由互联网用户自发贡献,该文观点与技术仅代表作者本人。本站仅提供信息存储空间服务,不拥有所有权,不承担相关法律责任。如发现本站有涉嫌侵权/违法违规的内容, 请发送邮件至 dio@foxmail.com 举报,一经查实,本站将立刻删除。

相关推荐


依赖报错 idea导入项目后依赖报错,解决方案:https://blog.csdn.net/weixin_42420249/article/details/81191861 依赖版本报错:更换其他版本 无法下载依赖可参考:https://blog.csdn.net/weixin_42628809/a
错误1:代码生成器依赖和mybatis依赖冲突 启动项目时报错如下 2021-12-03 13:33:33.927 ERROR 7228 [ main] o.s.b.d.LoggingFailureAnalysisReporter : *************************** APPL
错误1:gradle项目控制台输出为乱码 # 解决方案:https://blog.csdn.net/weixin_43501566/article/details/112482302 # 在gradle-wrapper.properties 添加以下内容 org.gradle.jvmargs=-Df
错误还原:在查询的过程中,传入的workType为0时,该条件不起作用 &lt;select id=&quot;xxx&quot;&gt; SELECT di.id, di.name, di.work_type, di.updated... &lt;where&gt; &lt;if test=&qu
报错如下,gcc版本太低 ^ server.c:5346:31: 错误:‘struct redisServer’没有名为‘server_cpulist’的成员 redisSetCpuAffinity(server.server_cpulist); ^ server.c: 在函数‘hasActiveC
解决方案1 1、改项目中.idea/workspace.xml配置文件,增加dynamic.classpath参数 2、搜索PropertiesComponent,添加如下 &lt;property name=&quot;dynamic.classpath&quot; value=&quot;tru
删除根组件app.vue中的默认代码后报错:Module Error (from ./node_modules/eslint-loader/index.js): 解决方案:关闭ESlint代码检测,在项目根目录创建vue.config.js,在文件中添加 module.exports = { lin
查看spark默认的python版本 [root@master day27]# pyspark /home/software/spark-2.3.4-bin-hadoop2.7/conf/spark-env.sh: line 2: /usr/local/hadoop/bin/hadoop: No s
使用本地python环境可以成功执行 import pandas as pd import matplotlib.pyplot as plt # 设置字体 plt.rcParams[&#39;font.sans-serif&#39;] = [&#39;SimHei&#39;] # 能正确显示负号 p
错误1:Request method ‘DELETE‘ not supported 错误还原:controller层有一个接口,访问该接口时报错:Request method ‘DELETE‘ not supported 错误原因:没有接收到前端传入的参数,修改为如下 参考 错误2:cannot r
错误1:启动docker镜像时报错:Error response from daemon: driver failed programming external connectivity on endpoint quirky_allen 解决方法:重启docker -&gt; systemctl r
错误1:private field ‘xxx‘ is never assigned 按Altʾnter快捷键,选择第2项 参考:https://blog.csdn.net/shi_hong_fei_hei/article/details/88814070 错误2:启动时报错,不能找到主启动类 #
报错如下,通过源不能下载,最后警告pip需升级版本 Requirement already satisfied: pip in c:\users\ychen\appdata\local\programs\python\python310\lib\site-packages (22.0.4) Coll
错误1:maven打包报错 错误还原:使用maven打包项目时报错如下 [ERROR] Failed to execute goal org.apache.maven.plugins:maven-resources-plugin:3.2.0:resources (default-resources)
错误1:服务调用时报错 服务消费者模块assess通过openFeign调用服务提供者模块hires 如下为服务提供者模块hires的控制层接口 @RestController @RequestMapping(&quot;/hires&quot;) public class FeignControl
错误1:运行项目后报如下错误 解决方案 报错2:Failed to execute goal org.apache.maven.plugins:maven-compiler-plugin:3.8.1:compile (default-compile) on project sb 解决方案:在pom.
参考 错误原因 过滤器或拦截器在生效时,redisTemplate还没有注入 解决方案:在注入容器时就生效 @Component //项目运行时就注入Spring容器 public class RedisBean { @Resource private RedisTemplate&lt;String
使用vite构建项目报错 C:\Users\ychen\work&gt;npm init @vitejs/app @vitejs/create-app is deprecated, use npm init vite instead C:\Users\ychen\AppData\Local\npm-