如何在Trisquel 8基于Ubuntu 16.04上从源代码构建gtk2

如何解决如何在Trisquel 8基于Ubuntu 16.04上从源代码构建gtk2

系统信息:

$ cat /etc/*-release
DISTRIB_ID=Trisquel
DISTRIB_RELEASE=8.0
DISTRIB_CODENAME=flidas
DISTRIB_DESCRIPTION="Trisquel GNU/Linux 8.0,Flidas"
NAME="Trisquel GNU/Linux"
VERSION="8.0,Flidas"
ID=trisquel
ID_LIKE=debian
PRETTY_NAME="Trisquel GNU/Linux Flidas (8.0)"
VERSION_ID="8.0"
HOME_URL="https://trisquel.info/"
SUPPORT_URL="https://trisquel.info/wiki"
BUG_REPORT_URL="https://trisquel.info/project/issues"

(Based on Ubuntu 16.04 LTS (Xenial Xerus))

$ uname -a
Linux technoethical-t400s-b9d0 4.19.139-gnu #1.0 SMP Tue Sep 27 12:35:59 EST 1983 x86_64 x86_64 x86_64 GNU/Linux

我正在尝试从源代码构建gtk2。我下载并解压缩了gtk + -2.24.0.tar.bz2,并安装了各种依赖项的开发版本(atk,pango,cairo,libgtk-pixbuf)设法对其进行配置。

当我这样做时,会出现类似以下的错误:

gtkiconcache.c: In function '_gtk_icon_cache_new_for_path':
gtkiconcache.c:95:13: warning: variable 'info' set but not used [-Wunused-but-set-variable]
   CacheInfo info;
             ^
gtkiconcache.c: In function '_gtk_icon_cache_get_icon':
gtkiconcache.c:435:3: error: unknown type name 'GdkPixdata'
   GdkPixdata pixdata;

稍作调查,看来GdkPixdata是在/usr/include/gdk-pixbuf-2.0/gdk-pixbuf/gdk-pixdata.h中定义的 此文件包含此定义

#ifndef GDK_PIXBUF_DISABLE_DEPRECATED
....
#endif

默认配置定义了GDK_PIXBUF_DISABLE_DEPRECATED,因此看起来确实从未定义过GdkPixdata(尽管gtkiconcache.c中包含了gdk-pixdata.h)

如果我停止通过散列配置文件中的跟随行来定义GDK_PIXBUF_DISABLE_DEPRECATED:

CFLAGS="-DGDK_PIXBUF_DISABLE_DEPRECATED $CFLAGS"

然后尝试使我得到以下链接错误:

/bin/bash ../libtool  --tag=CC   --mode=link gcc  -g -O2 -Wall   -o gtk-query-immodules-2.0 queryimmodules.o libgtk-x11-2.0.la ../gdk/libgdk-x11-2.0.la -lpangocairo-1.0 -lX11 -lXfixes -lXcomposite -latk-1.0 -lcairo -lgdk_pixbuf-2.0 -lgio-2.0 -lpangoft2-1.0 -lpango-1.0 -lgobject-2.0 -lglib-2.0 -lfontconfig -lfreetype
libtool: link: gcc -g -O2 -Wall -o .libs/gtk-query-immodules-2.0 queryimmodules.o  ./.libs/libgtk-x11-2.0.so /local/usr/local/src/gtk+-2.24.0/gdk/.libs/libgdk-x11-2.0.so ../gdk/.libs/libgdk-x11-2.0.so -latk-1.0 -lpangoft2-1.0 -lpangocairo-1.0 -lpango-1.0 -lgio-2.0 -lfontconfig /usr/lib/x86_64-linux-gnu/libfreetype.so -lXrender -lXfixes -lXcomposite -lgdk_pixbuf-2.0 -lgobject-2.0 -lglib-2.0 -lcairo -lX11 -lXext -Wl,-rpath -Wl,/local/usr/local/gtk2.0/lib
/usr/bin/ld: queryimmodules.o: undefined reference to symbol 'g_module_symbol'
//usr/lib/x86_64-linux-gnu/libgmodule-2.0.so.0: error adding symbols: DSO missing from command line
collect2: error: ld returned 1 exit status

有人知道我应该如何构建gtk2吗?

有人对我应该从这里去哪里有任何建议?

我应该定义-DGDK_PIXBUF_DISABLE_DEPRECATED还是我需要其他版本的gdk-pixbuf(或其他版本)?

版权声明:本文内容由互联网用户自发贡献,该文观点与技术仅代表作者本人。本站仅提供信息存储空间服务,不拥有所有权,不承担相关法律责任。如发现本站有涉嫌侵权/违法违规的内容, 请发送邮件至 dio@foxmail.com 举报,一经查实,本站将立刻删除。

相关推荐


依赖报错 idea导入项目后依赖报错,解决方案:https://blog.csdn.net/weixin_42420249/article/details/81191861 依赖版本报错:更换其他版本 无法下载依赖可参考:https://blog.csdn.net/weixin_42628809/a
错误1:代码生成器依赖和mybatis依赖冲突 启动项目时报错如下 2021-12-03 13:33:33.927 ERROR 7228 [ main] o.s.b.d.LoggingFailureAnalysisReporter : *************************** APPL
错误1:gradle项目控制台输出为乱码 # 解决方案:https://blog.csdn.net/weixin_43501566/article/details/112482302 # 在gradle-wrapper.properties 添加以下内容 org.gradle.jvmargs=-Df
错误还原:在查询的过程中,传入的workType为0时,该条件不起作用 <select id="xxx"> SELECT di.id, di.name, di.work_type, di.updated... <where> <if test=&qu
报错如下,gcc版本太低 ^ server.c:5346:31: 错误:‘struct redisServer’没有名为‘server_cpulist’的成员 redisSetCpuAffinity(server.server_cpulist); ^ server.c: 在函数‘hasActiveC
解决方案1 1、改项目中.idea/workspace.xml配置文件,增加dynamic.classpath参数 2、搜索PropertiesComponent,添加如下 <property name="dynamic.classpath" value="tru
删除根组件app.vue中的默认代码后报错:Module Error (from ./node_modules/eslint-loader/index.js): 解决方案:关闭ESlint代码检测,在项目根目录创建vue.config.js,在文件中添加 module.exports = { lin
查看spark默认的python版本 [root@master day27]# pyspark /home/software/spark-2.3.4-bin-hadoop2.7/conf/spark-env.sh: line 2: /usr/local/hadoop/bin/hadoop: No s
使用本地python环境可以成功执行 import pandas as pd import matplotlib.pyplot as plt # 设置字体 plt.rcParams['font.sans-serif'] = ['SimHei'] # 能正确显示负号 p
错误1:Request method ‘DELETE‘ not supported 错误还原:controller层有一个接口,访问该接口时报错:Request method ‘DELETE‘ not supported 错误原因:没有接收到前端传入的参数,修改为如下 参考 错误2:cannot r
错误1:启动docker镜像时报错:Error response from daemon: driver failed programming external connectivity on endpoint quirky_allen 解决方法:重启docker -> systemctl r
错误1:private field ‘xxx‘ is never assigned 按Altʾnter快捷键,选择第2项 参考:https://blog.csdn.net/shi_hong_fei_hei/article/details/88814070 错误2:启动时报错,不能找到主启动类 #
报错如下,通过源不能下载,最后警告pip需升级版本 Requirement already satisfied: pip in c:\users\ychen\appdata\local\programs\python\python310\lib\site-packages (22.0.4) Coll
错误1:maven打包报错 错误还原:使用maven打包项目时报错如下 [ERROR] Failed to execute goal org.apache.maven.plugins:maven-resources-plugin:3.2.0:resources (default-resources)
错误1:服务调用时报错 服务消费者模块assess通过openFeign调用服务提供者模块hires 如下为服务提供者模块hires的控制层接口 @RestController @RequestMapping("/hires") public class FeignControl
错误1:运行项目后报如下错误 解决方案 报错2:Failed to execute goal org.apache.maven.plugins:maven-compiler-plugin:3.8.1:compile (default-compile) on project sb 解决方案:在pom.
参考 错误原因 过滤器或拦截器在生效时,redisTemplate还没有注入 解决方案:在注入容器时就生效 @Component //项目运行时就注入Spring容器 public class RedisBean { @Resource private RedisTemplate<String
使用vite构建项目报错 C:\Users\ychen\work>npm init @vitejs/app @vitejs/create-app is deprecated, use npm init vite instead C:\Users\ychen\AppData\Local\npm-